Cu2O3-

Vibrational and/or electronic energy levels

Data compiled by: Marilyn E. Jacox

State:   ?

 Energy
 (cm-1
 Med.   Transition   λmin
 (nm)
 λmax
 (nm)

References

Td = 28560 ± 240 gas Wang, Wu, et al., 1996

Additional references: Jacox, 1998, page 295

Wang, Wu, et al., 1996
Wang, L.S.; Wu, H.; Desai, S.R.; Lou, L., Electronic Structure of Small Copper Oxide Clusters: From Cu2O to Cu2O4, Phys. Rev. B: Cond. Matt., 1996, 53, 12, 8028, https://doi.org/10.1103/PhysRevB.53.8028 . [all data]

Jacox, 1998
Jacox, M.E., Vibrational and electronic energy levels of polyatomic transient molecules: supplement A, J. Phys. Chem. Ref. Data, 1998, 27, 2, 115-393, https://doi.org/10.1063/1.556017 . [all data]