CuO3-

Vibrational and/or electronic energy levels

Data compiled by: Marilyn E. Jacox

State:   ?

 Energy
 (cm-1
 Med.   Transition   λmin
 (nm)
 λmax
 (nm)

References

Td = 25740 ± 320 gas Wu, Desai, et al., 1997

Additional references: Jacox, 1998, page 252

Wu, Desai, et al., 1997
Wu, H.; Desai, S.R.; Wang, L., Chemical Bonding between Cu and Oxygen - Copper Oxides versus O2 Complexes: A Study of CuOx(x=0-6) Species by Anion Photoelectron Spectroscopy, J. Phys. Chem., 1997, 101, 11, 2103, https://doi.org/10.1021/jp9631442 . [all data]

Jacox, 1998
Jacox, M.E., Vibrational and electronic energy levels of polyatomic transient molecules: supplement A, J. Phys. Chem. Ref. Data, 1998, 27, 2, 115-393, https://doi.org/10.1063/1.556017 . [all data]