CuH2-

Vibrational and/or electronic energy levels

Data compiled by: Marilyn E. Jacox

State:   ?

 Energy
 (cm-1
 Med.   Transition   λmin
 (nm)
 λmax
 (nm)

References

Td = 20980 ± 400 gas Calvi, Andrews, et al., 2007

State:   X

Vib.
sym.
 No.   Approximate
 type of mode
 cm-1   Med.   Method   References

Σu- 3 Asym. stretch 1529.5 Ne IR Andrews and Wang, 2003
Wang and Andrews, 2003
3 Asym. stretch 1497.2 Ar IR Andrews and Wang, 2003
Wang and Andrews, 2003
3 Asym. stretch 1517.8 H2 IR Andrews and Wang, 2003
Wang and Andrews, 2003

Calvi, Andrews, et al., 2007
Calvi, R.M.D.; Andrews, D.H.; Lineberger, W.C., Negative ion photoelectron spectroscopy of copper hydrides, Chem. Phys. Lett., 2007, 442, 1-3, 12, https://doi.org/10.1016/j.cplett.2007.05.060 . [all data]

Andrews and Wang, 2003
Andrews, L.; Wang, X., Infrared Spectra and Structures of the Stable CuH, J. Am. Chem. Soc., 2003, 125, 38, 11751, https://doi.org/10.1021/ja036307q . [all data]

Wang and Andrews, 2003
Wang, X.; Andrews, L., Gold Is Noble but Gold Hydride Anions Are Stable, Angew. Chem. Int. Ed., 2003, 42, 42, 5201, https://doi.org/10.1002/anie.200351780 . [all data]