Cr2O4

Vibrational and/or electronic energy levels

Data compiled by: Marilyn E. Jacox

State:   X

Vib.
sym.
 No.   Approximate
 type of mode
 cm-1   Med.   Method   References

716.1 Ar IR Chertihin, Bare, et al., 1997
643.1 Ar IR Chertihin, Bare, et al., 1997

Additional references: Jacox, 2003, page 329

References

Chertihin, Bare, et al., 1997
Chertihin, G.V.; Bare, W.D.; Andrews, L., Reactions of laser-ablated chromium atoms with dioxygen. Infrared spectra of CrO, OCrO, CrOO, CrO[sub 3], Cr(OO)[sub 2], Cr[sub 2]O[sub 2], Cr[sub 2]O[sub 3] and Cr[sub 2]O[sub 4] in solid argon, J. Chem. Phys., 1997, 107, 8, 2798, https://doi.org/10.1063/1.474637 . [all data]

Jacox, 2003
Jacox, M.E., Vibrational and electronic energy levels of polyatomic transient molecules: supplement B, J. Phys. Chem. Ref. Data, 2003, 32, 1, 1-441, https://doi.org/10.1063/1.1497629 . [all data]