OCrO-

Vibrational and/or electronic energy levels

Data compiled by: Marilyn E. Jacox

State:   ?

 Energy
 (cm-1
 Med.   Transition   λmin
 (nm)
 λmax
 (nm)

References

Td = 19470 ± 65 gas Flesch, White, et al., 1969
Wenthold, Jonas, et al., 1997
Gutsev, Jena, et al., 2001

State:   X

Vib.
sym.
 No.   Approximate
 type of mode
 cm-1   Med.   Method   References

a1 1 Sym. stretch 847.1 Ne IR Zhou and Andrews, 1999
b2 3 Asym. stretch 918.7 Ne IR Zhou and Andrews, 1999

Additional references: Jacox, 1998, page 182; Jacox, 2003, page 117

Flesch, White, et al., 1969
Flesch, G.D.; White, R.M.; Svec, H.J., The positive and negative ion mass spectra of chromyl chloride and chromyl fluoride, Intern. J. Mass Spectrom. Ion Phys., 1969, 3, 339. [all data]

Wenthold, Jonas, et al., 1997
Wenthold, P.G.; Jonas, K.-L.; Lineberger, W.C., Ultraviolet Photoelectron Spectroscopy of the Chromium Dioxide Negative Ion, J. Chem. Phys., 1997, 106, 23, 9961, https://doi.org/10.1063/1.473840 . [all data]

Gutsev, Jena, et al., 2001
Gutsev, G.L.; Jena, P.; Zhai, H.-J.; Wang, L.-S., Electronic structure of chromium oxides, CrO[sub n][sup -] and CrO[sub n] (n=1--5) from photoelectron spectroscopy and density functional theory calculations, J. Chem. Phys., 2001, 115, 17, 7935, https://doi.org/10.1063/1.1405438 . [all data]

Zhou and Andrews, 1999
Zhou, M.; Andrews, L., Infrared spectra and density functional calculations of the CrO[sub 2][sup -], MoO[sub 2][sup -], and WO[sub 2][sup -] molecular anions in solid neon, J. Chem. Phys., 1999, 111, 9, 4230, https://doi.org/10.1063/1.479721 . [all data]

Jacox, 1998
Jacox, M.E., Vibrational and electronic energy levels of polyatomic transient molecules: supplement A, J. Phys. Chem. Ref. Data, 1998, 27, 2, 115-393, https://doi.org/10.1063/1.556017 . [all data]

Jacox, 2003
Jacox, M.E., Vibrational and electronic energy levels of polyatomic transient molecules: supplement B, J. Phys. Chem. Ref. Data, 2003, 32, 1, 1-441, https://doi.org/10.1063/1.1497629 . [all data]