cyc-CrNO

Vibrational and/or electronic energy levels

Data compiled by: Marilyn E. Jacox

State:   X

Vib.
sym.
 No.   Approximate
 type of mode
 cm-1   Med.   Method   References

a' 1 NO stretch 1123.9 Ne IR Andrews and Wang, 2002
1 NO stretch 1108.8 Ar IR Zhou and Andrews, 1998
2 CrN stretch 528.2 w Ar IR Zhou and Andrews, 1998
3 CrO stretch 478.0 w Ar IR Zhou and Andrews, 1998

Additional references: Jacox, 2003, page 89

References

Andrews and Wang, 2002
Andrews, L.; Wang, X., Infrared Spectra and Density Functional Calculations for Early First-Row Transition Metal Nitrosyls in Solid Neon, J. Phys. Chem. A, 2002, 106, 7, 1196, https://doi.org/10.1021/jp013443d . [all data]

Zhou and Andrews, 1998
Zhou, M.; Andrews, L., Reactions of Laser-Ablated Chromium Atoms with Nitric Oxide: Infrared Spectra of NCrO, Cr-(η, J. Phys. Chem. A, 1998, 102, 38, 7452, https://doi.org/10.1021/jp981780p . [all data]

Jacox, 2003
Jacox, M.E., Vibrational and electronic energy levels of polyatomic transient molecules: supplement B, J. Phys. Chem. Ref. Data, 2003, 32, 1, 1-441, https://doi.org/10.1063/1.1497629 . [all data]