cyc-Co2N

Vibrational and/or electronic energy levels

Data compiled by: Marilyn E. Jacox

State:   X

Vib.
sym.
 No.   Approximate
 type of mode
 cm-1   Med.   Method   References

a1 1 CoN s-stretch 746.8 Ar IR Andrews, Citra, et al., 1998
1 CoN s-stretch 745.4 N2 IR Andrews, Citra, et al., 1998

Additional references: Jacox, 2003, page 53

References

Andrews, Citra, et al., 1998
Andrews, L.; Citra, A.; Chertihin, G.V.; Bare, W.D.; Neurock, M., Reactions of Laser-Ablated Co and Ni Atoms with Nitrogen Atoms and Molecules. Infrared Spectra and DFT Calculations of Metal Nitride Molecular Species and Complexes, J. Phys. Chem. A, 1998, 102, 15, 2561, https://doi.org/10.1021/jp9802836 . [all data]

Jacox, 2003
Jacox, M.E., Vibrational and electronic energy levels of polyatomic transient molecules: supplement B, J. Phys. Chem. Ref. Data, 2003, 32, 1, 1-441, https://doi.org/10.1063/1.1497629 . [all data]