Co(NO)3

Vibrational and/or electronic energy levels

Data compiled by: Marilyn E. Jacox

State:   X

Vib.
sym.
 No.   Approximate
 type of mode
 cm-1   Med.   Method   References

a1 1 NO stretch 1825.6 Ne IR Zhou and Andrews, 2000
1 NO stretch 1814.6 Ar IR Zhou and Andrews, 2000
CoN stretch 579.3 Ar IR Zhou and Andrews, 2000
e NO stretch 1782.1 Ne IR Zhou and Andrews, 2000
NO stretch 1770.1 Ar IR Zhou and Andrews, 2000
CoN stretch 493.8 Ar IR Zhou and Andrews, 2000

Additional references: Jacox, 2003, page 346

References

Zhou and Andrews, 2000
Zhou, M.; Andrews, L., Reactions of Laser-Ablated Fe, Co, and Ni with NO: Infrared Spectra and Density Functional Calculations of MNO, J. Phys. Chem. A, 2000, 104, 17, 3915, https://doi.org/10.1021/jp993340j . [all data]

Jacox, 2003
Jacox, M.E., Vibrational and electronic energy levels of polyatomic transient molecules: supplement B, J. Phys. Chem. Ref. Data, 2003, 32, 1, 1-441, https://doi.org/10.1063/1.1497629 . [all data]