O2ClONO2

Vibrational and/or electronic energy levels

Data compiled by: Marilyn E. Jacox

State:   X

Vib.
sym.
 No.   Approximate
 type of mode
 cm-1   Med.   Method   References

1 NO2 a-stretch 1658.0 vs gas IR Friedl, Sander, et al., 1992
2 ClO2 a-stretch 1275.2 s gas IR Friedl, Sander, et al., 1992
3 NO2 s-stretch 1249.7 w m gas IR Friedl, Sander, et al., 1992
4 ClO2 s-stretch 1071.8 s gas IR Friedl, Sander, et al., 1992
5 ClO stretch 838.4 s gas IR Friedl, Sander, et al., 1992
7 NO2 wag 718.4 w m gas IR Friedl, Sander, et al., 1992
8 NO stretch 613.3 m gas IR Friedl, Sander, et al., 1992

Additional references: Jacox, 1994, page 371

References

Friedl, Sander, et al., 1992
Friedl, R.R.; Sander, S.P.; Yung, Y.L., Chloryl nitrate: a novel product of the chlorine oxide (OClO) + nitrate radical + M recombination, J. Phys. Chem., 1992, 96, 19, 7490, https://doi.org/10.1021/j100198a002 . [all data]

Jacox, 1994
Jacox, M.E., Vibrational and electronic energy levels of polyatomic transient molecules, American Chemical Society, Washington, DC, 1994, 464. [all data]