HInCl(OH)

Vibrational and/or electronic energy levels

Data compiled by: Marilyn E. Jacox

State:   X

Vib.
sym.
 No.   Approximate
 type of mode
 cm-1   Med.   Method   References

OH stretch 3649.3 Ar IR Himmel, Downs, et al., 2000
InH stretch 1857.2 Ar IR Himmel, Downs, et al., 2000
810.0 Ar IR Himmel, Downs, et al., 2000
606.4 Ar IR Himmel, Downs, et al., 2000
451.6 Ar IR Himmel, Downs, et al., 2000
428.3 Ar IR Himmel, Downs, et al., 2000
348.5 Ar IR Himmel, Downs, et al., 2000

Additional references: Jacox, 2003, page 269

References

Himmel, Downs, et al., 2000
Himmel, H.-J.; Downs, A.J.; Greene, T.M., Formation and Characterization of the Indium Hydride Molecules H, J. Am. Chem. Soc., 2000, 122, 5, 922, https://doi.org/10.1021/ja9932333 . [all data]

Jacox, 2003
Jacox, M.E., Vibrational and electronic energy levels of polyatomic transient molecules: supplement B, J. Phys. Chem. Ref. Data, 2003, 32, 1, 1-441, https://doi.org/10.1063/1.1497629 . [all data]