InH2Cl

Vibrational and/or electronic energy levels

Data compiled by: Marilyn E. Jacox

State:   X

Vib.
sym.
 No.   Approximate
 type of mode
 cm-1   Med.   Method   References

a1 1 InH2 s-stretch 1804.0 Ar IR Himmel, Downs, et al., 2000
2 InH2 scissors 575.8 Ar IR Himmel, Downs, et al., 2000
3 InCl stretch 343.4 Ar IR Himmel, Downs, et al., 2000
b1 4 OPLA 541.4 Ar IR Himmel, Downs, et al., 2000
b2 5 InH2 a-stretch 1820.3 Ar IR Himmel, Downs, et al., 2000
6 HInCl deform. 415.7 Ar IR Himmel, Downs, et al., 2000

Additional references: Jacox, 2003, page 172

References

Himmel, Downs, et al., 2000
Himmel, H.-J.; Downs, A.J.; Greene, T.M., Formation and Characterization of the Indium Hydride Molecules H, J. Am. Chem. Soc., 2000, 122, 5, 922, https://doi.org/10.1021/ja9932333 . [all data]

Jacox, 2003
Jacox, M.E., Vibrational and electronic energy levels of polyatomic transient molecules: supplement B, J. Phys. Chem. Ref. Data, 2003, 32, 1, 1-441, https://doi.org/10.1063/1.1497629 . [all data]