HCaH2CaH

Vibrational and/or electronic energy levels

Data compiled by: Marilyn E. Jacox

State:   X

Vib.
sym.
 No.   Approximate
 type of mode
 cm-1   Med.   Method   References

b1u t-CaH stretch 1221.0 Ne IR Wang and Andrews, 2004
t-CaH stretch 1124.3 Kr IR Xiao, Hauge, et al., 1991
t-CaH stretch 1215.4 H2 IR Wang and Andrews, 2004
br-CaH stretch 1072 Ne IR Wang and Andrews, 2004
br-CaH stretch 1070 Ar IR Wang and Andrews, 2004
br-CaH stretch 1057 Ar IR Wang and Andrews, 2004
br-CaH stretch 1024.3 Kr IR Xiao, Hauge, et al., 1991
br-CaH stretch 1071 p-H2 IR Wang and Andrews, 2004
br-CaH stretch 1073 H2 IR Wang and Andrews, 2004
b2u br-CaH stretch 878 Ne IR Wang and Andrews, 2004
br-CaH stretch 874 Ar IR Wang and Andrews, 2004
br-CaH stretch 869.7 Kr IR Xiao, Hauge, et al., 1991
br-CaH stretch 876 p-H2 IR Wang and Andrews, 2004
br-CaH stretch 877 H2 IR Wang and Andrews, 2004
596.6 Kr IR Xiao, Hauge, et al., 1991

Additional references: Jacox, 1994, page 305

References

Wang and Andrews, 2004
Wang, X.; Andrews, L., Metal Dihydride (MH, J. Phys. Chem. A, 2004, 108, 52, 11500, https://doi.org/10.1021/jp046046m . [all data]

Xiao, Hauge, et al., 1991
Xiao, Z.L.; Hauge, R.H.; Margrave, J.L., High Temp. Sci., 1991, 31, 59. [all data]

Jacox, 1994
Jacox, M.E., Vibrational and electronic energy levels of polyatomic transient molecules, American Chemical Society, Washington, DC, 1994, 464. [all data]