C15-

Vibrational and/or electronic energy levels

Data compiled by: Marilyn E. Jacox

State:   B

 Energy
 (cm-1
 Med.   Transition   λmin
 (nm)
 λmax
 (nm)

References

To = 10100 ± 100 gas B-X 833 990 Ohara, Kasuya, et al., 2000

State:   A

 Energy
 (cm-1
 Med.   Transition   λmin
 (nm)
 λmax
 (nm)

To = 8300 ± 100 gas A-X 1123 1205 Ohara, Kasuya, et al., 2000
To = 8316 Ne Wyss, Grutter, et al., 1999

Vib.
sym.
 No.   Approximate
 type of mode
 cm-1   Med.   Method   References

300 T gas MPD Ohara, Kasuya, et al., 2000

Additional references: Jacox, 2003, page 384

Ohara, Kasuya, et al., 2000
Ohara, M.; Kasuya, D.; Shiromaru, H.; Achiba, Y., Resonance-Enhanced Multiphoton Electron Detachment (REMPED) Study of Carbon Anions up to C, J. Phys. Chem. A, 2000, 104, 38, 8622, https://doi.org/10.1021/jp0010637 . [all data]

Wyss, Grutter, et al., 1999
Wyss, M.; Grutter, M.; Maier, J.P., Electronic spectra of long odd-number carbon chains C17--C21 and C13---C21-, Chem. Phys. Lett., 1999, 304, 1-2, 35, https://doi.org/10.1016/S0009-2614(99)00285-7 . [all data]

Jacox, 2003
Jacox, M.E., Vibrational and electronic energy levels of polyatomic transient molecules: supplement B, J. Phys. Chem. Ref. Data, 2003, 32, 1, 1-441, https://doi.org/10.1063/1.1497629 . [all data]