C14H

Vibrational and/or electronic energy levels

Data compiled by: Marilyn E. Jacox

State:   2Π

 Energy
 (cm-1
 Med.   Transition   λmin
 (nm)
 λmax
 (nm)

References

To = 11554 ± 5 T Ne Freivogel, Fulara, et al., 1995

Additional references: Jacox, 1998, page 356; Jacox, 2003, page 383; Gottlieb, McCarthy, et al., 1998

Freivogel, Fulara, et al., 1995
Freivogel, P.; Fulara, J.; Jakobi, M.; Forney, D.; Maier, J.P., Electronic absorption spectra of linear carbon chains in neon matrices. II. C-2n, C2n, and C2nH, J. Chem. Phys., 1995, 103, 1, 54, https://doi.org/10.1063/1.469621 . [all data]

Jacox, 1998
Jacox, M.E., Vibrational and electronic energy levels of polyatomic transient molecules: supplement A, J. Phys. Chem. Ref. Data, 1998, 27, 2, 115-393, https://doi.org/10.1063/1.556017 . [all data]

Jacox, 2003
Jacox, M.E., Vibrational and electronic energy levels of polyatomic transient molecules: supplement B, J. Phys. Chem. Ref. Data, 2003, 32, 1, 1-441, https://doi.org/10.1063/1.1497629 . [all data]

Gottlieb, McCarthy, et al., 1998
Gottlieb, C.A.; McCarthy, M.C.; Travers, M.J.; Grabow, J.-U.; Thaddeus, P., Rotational spectra of the carbon chain free radicals C[sub 10]H, C[sub 12]H, C[sub 13]H, and C[sub 14]H, J. Chem. Phys., 1998, 109, 13, 5433, https://doi.org/10.1063/1.477161 . [all data]