C14

Vibrational and/or electronic energy levels

Data compiled by: Marilyn E. Jacox

State:   A

 Energy
 (cm-1
 Med.   Transition   λmin
 (nm)
 λmax
 (nm)

References

To = 19010 N2 A-X 526 640 Rechtsteiner, Felix, et al., 2001

Vib.
sym.
 No.   Approximate
 type of mode
 cm-1   Med.   Method   References

437 N2 LF Rechtsteiner, Felix, et al., 2001
108 N2 LF Rechtsteiner, Felix, et al., 2001

State:   X

Vib.
sym.
 No.   Approximate
 type of mode
 cm-1   Med.   Method   References

2218 N2 LF Rechtsteiner, Felix, et al., 2001
2089 N2 LF Rechtsteiner, Felix, et al., 2001
1926 N2 LF Rechtsteiner, Felix, et al., 2001
1807 N2 LF Rechtsteiner, Felix, et al., 2001
1655 N2 LF Rechtsteiner, Felix, et al., 2001
1627 N2 LF Rechtsteiner, Felix, et al., 2001
1394 N2 LF Rechtsteiner, Felix, et al., 2001
1211 N2 LF Rechtsteiner, Felix, et al., 2001
851 N2 LF Rechtsteiner, Felix, et al., 2001
829 N2 LF Rechtsteiner, Felix, et al., 2001
282 N2 LF Rechtsteiner, Felix, et al., 2001

Additional references: Jacox, 2003, page 382

Rechtsteiner, Felix, et al., 2001
Rechtsteiner, G.A.; Felix, C.; Ott, A.K.; Hampe, O.; Van Duyne, R.P.; Jarrold, M.F.; Raghavachari, K., Raman and Fluorescence Spectra of Size-Selected, Matrix-Isolated C, J. Phys. Chem. A, 2001, 105, 13, 3029, https://doi.org/10.1021/jp003615r . [all data]

Jacox, 2003
Jacox, M.E., Vibrational and electronic energy levels of polyatomic transient molecules: supplement B, J. Phys. Chem. Ref. Data, 2003, 32, 1, 1-441, https://doi.org/10.1063/1.1497629 . [all data]