C13N

Vibrational and/or electronic energy levels

Data compiled by: Marilyn E. Jacox

State:   2Π

 Energy
 (cm-1
 Med.   Transition   λmin
 (nm)
 λmax
 (nm)

References

To = 12085 ± 3 Ne 2Π-X 750 828 Grutter, Wyss, et al., 1999

Vib.
sym.
 No.   Approximate
 type of mode
 cm-1   Med.   Method   References

Σ+ C-C stretch 1238 ± 4 Ne AB Grutter, Wyss, et al., 1999

Additional references: Jacox, 2003, page 389

Grutter, Wyss, et al., 1999
Grutter, M.; Wyss, M.; Maier, J.P., Electronic absorption spectra of C[sub 2n]H[sup -], C[sub 2n-1]N[sup -] (n=4--7), and C[sub 2n-1]N (n=3--7) chains in neon matrices, J. Chem. Phys., 1999, 110, 3, 1492, https://doi.org/10.1063/1.478022 . [all data]

Jacox, 2003
Jacox, M.E., Vibrational and electronic energy levels of polyatomic transient molecules: supplement B, J. Phys. Chem. Ref. Data, 2003, 32, 1, 1-441, https://doi.org/10.1063/1.1497629 . [all data]