HC12CN-

Vibrational and/or electronic energy levels

Data compiled by: Marilyn E. Jacox

State:   (3) 2Π

 Energy
 (cm-1
 Med.   Transition   λmin
 (nm)
 λmax
 (nm)

References

To = 29762 ± 18 Ne Grutter, Wyss, et al., 1998

State:   (2) 2Π

 Energy
 (cm-1
 Med.   Transition   λmin
 (nm)
 λmax
 (nm)

To = 12692 ± 3 Ne (2) 2Π-X 624 788 Grutter, Wyss, et al., 1998

Vib.
sym.
 No.   Approximate
 type of mode
 cm-1   Med.   Method   References

Σ+ CH stretch 3326 ± 7 Ne AB Grutter, Wyss, et al., 1998
CC stretch 2173 ± 7 Ne AB Grutter, Wyss, et al., 1998
CC stretch 1902 ± 7 Ne AB Grutter, Wyss, et al., 1998

State:   (1) 2Π

 Energy
 (cm-1
 Med.   Transition   λmin
 (nm)
 λmax
 (nm)

To = 12038 ± 3 Ne (1) 2Π-X 711 831 Grutter, Wyss, et al., 1998

Vib.
sym.
 No.   Approximate
 type of mode
 cm-1   Med.   Method   References

Σ+ CC stretch 2019 ± 6 Ne AB Grutter, Wyss, et al., 1998

Additional references: Jacox, 2003, page 390

Grutter, Wyss, et al., 1998
Grutter, M.; Wyss, M.; Fulara, J.; Maier, J.P., Electronic Absorption Spectra of the Polyacetylene Chains HC, J. Phys. Chem. A, 1998, 102, 48, 9785, https://doi.org/10.1021/jp983185t . [all data]

Jacox, 2003
Jacox, M.E., Vibrational and electronic energy levels of polyatomic transient molecules: supplement B, J. Phys. Chem. Ref. Data, 2003, 32, 1, 1-441, https://doi.org/10.1063/1.1497629 . [all data]