HC12H

Vibrational and/or electronic energy levels

Data compiled by: Marilyn E. Jacox

State:   1Su+

 Energy
 (cm-1
 Med.   Transition   λmin
 (nm)
 λmax
 (nm)

References

To = 38971 ± 30 Ne 1Su+-X 232 257 Grutter, Wyss, et al., 1998

Vib.
sym.
 No.   Approximate
 type of mode
 cm-1   Med.   Method   References

Σg+ CC stretch 2029 ± 40 Ne AB Grutter, Wyss, et al., 1998

Additional references: Jacox, 2003, page 381

Grutter, Wyss, et al., 1998
Grutter, M.; Wyss, M.; Fulara, J.; Maier, J.P., Electronic Absorption Spectra of the Polyacetylene Chains HC, J. Phys. Chem. A, 1998, 102, 48, 9785, https://doi.org/10.1021/jp983185t . [all data]

Jacox, 2003
Jacox, M.E., Vibrational and electronic energy levels of polyatomic transient molecules: supplement B, J. Phys. Chem. Ref. Data, 2003, 32, 1, 1-441, https://doi.org/10.1063/1.1497629 . [all data]