HC10CN-

Vibrational and/or electronic energy levels

Data compiled by: Marilyn E. Jacox

State:   (3) 2Π

 Energy
 (cm-1
 Med.   Transition   λmin
 (nm)
 λmax
 (nm)

References

To = 32895 ± 22 Ne Grutter, Wyss, et al., 1998

State:   (2) 2Π

 Energy
 (cm-1
 Med.   Transition   λmin
 (nm)
 λmax
 (nm)

To = 14196 ± 4 Ne (2) 2Π-X 534 705 Grutter, Wyss, et al., 1998

Vib.
sym.
 No.   Approximate
 type of mode
 cm-1   Med.   Method   References

Σ+ CH stretch 3338 ± 9 Ne AB Grutter, Wyss, et al., 1998
CC stretch 2297 ± 9 Ne AB Grutter, Wyss, et al., 1998
CC stretch 1974 ± 9 Ne AB Grutter, Wyss, et al., 1998

State:   (1) 2Π

 Energy
 (cm-1
 Med.   Transition   λmin
 (nm)
 λmax
 (nm)

To = 13466 ± 4 Ne (1) 2Π-X 566 743 Grutter, Wyss, et al., 1998

Vib.
sym.
 No.   Approximate
 type of mode
 cm-1   Med.   Method   References

Σ+ 2117 Ne AB Grutter, Wyss, et al., 1998

Additional references: Jacox, 2003, page 389

Grutter, Wyss, et al., 1998
Grutter, M.; Wyss, M.; Fulara, J.; Maier, J.P., Electronic Absorption Spectra of the Polyacetylene Chains HC, J. Phys. Chem. A, 1998, 102, 48, 9785, https://doi.org/10.1021/jp983185t . [all data]

Jacox, 2003
Jacox, M.E., Vibrational and electronic energy levels of polyatomic transient molecules: supplement B, J. Phys. Chem. Ref. Data, 2003, 32, 1, 1-441, https://doi.org/10.1063/1.1497629 . [all data]