m-(CH2)2C6H4-

Vibrational and/or electronic energy levels

Data compiled by: Marilyn E. Jacox

State:   ?

 Energy
 (cm-1
 Med.   Transition   λmin
 (nm)
 λmax
 (nm)

References

Td = 7410 ± 65 gas Wenthold, Kim, et al., 1997

State:   X

Vib.
sym.
 No.   Approximate
 type of mode
 cm-1   Med.   Method   References

a1 275 ± 20 gas PE Wenthold, Kim, et al., 1997

Additional references: Jacox, 1998, page 352

Wenthold, Kim, et al., 1997
Wenthold, P.G.; Kim, J.B.; Lineberger, W.C., Photoelectron Spectroscopy of m-Xylylene Anion, J. Am. Chem. Soc., 1997, 119, 6, 1354, https://doi.org/10.1021/ja9623830 . [all data]

Jacox, 1998
Jacox, M.E., Vibrational and electronic energy levels of polyatomic transient molecules: supplement A, J. Phys. Chem. Ref. Data, 1998, 27, 2, 115-393, https://doi.org/10.1063/1.556017 . [all data]