C7Xe

Vibrational and/or electronic energy levels

Data compiled by: Marilyn E. Jacox

State:   X

Vib.
sym.
 No.   Approximate
 type of mode
 cm-1   Med.   Method   References

CC stretch 2126.6 T Ar IR Wang, Szczepanski, et al., 2004

References

Wang, Szczepanski, et al., 2004
Wang, H.; Szczepanski, J.; Vala, M., Infrared absorption spectroscopy of the CnXe (n = 2, 3, 5, 7, 9) species, Phys. Chem. Chem. Phys., 2004, 6, 16, 4090, https://doi.org/10.1039/b405040a . [all data]