(4-BrC6H4)CH2

Vibrational and/or electronic energy levels

Data compiled by: Marilyn E. Jacox

State:   X

Vib.
sym.
 No.   Approximate
 type of mode
 cm-1   Med.   Method   References

a' 4 C-CH2 stretch 1510 ± 40 gas PE Kim, Wenthold, et al., 1999
13 Ring deform. 290 ± 20 gas PE Kim, Wenthold, et al., 1999

Additional references: Jacox, 2003, page 404

References

Kim, Wenthold, et al., 1999
Kim, J.B.; Wenthold, P.G.; Lineberger, W.C., Ultraviolet Photoelectron Spectroscopy of, J. Phys. Chem. A, 1999, 103, 50, 10833, https://doi.org/10.1021/jp992817o . [all data]

Jacox, 2003
Jacox, M.E., Vibrational and electronic energy levels of polyatomic transient molecules: supplement B, J. Phys. Chem. Ref. Data, 2003, 32, 1, 1-441, https://doi.org/10.1063/1.1497629 . [all data]