3,5-C6H3CH3

Vibrational and/or electronic energy levels

Data compiled by: Marilyn E. Jacox

State:   X

Vib.
sym.
 No.   Approximate
 type of mode
 cm-1   Med.   Method   References

a' CH3 deform. 1533 w m Ar IR Sander and Exner, 1999
Ring deform. 1462 m s Ar IR Sander and Exner, 1999
CH wag 824 m Ar IR Sander and Exner, 1999
CH wag 768 m Ar IR Sander and Exner, 1999
Deformation 570 w m Ar IR Sander and Exner, 1999
a CH3 deform. 1570 w m Ar IR Sander and Exner, 1999
Mixed 1000 w m Ar IR Sander and Exner, 1999
Ring deform. 543 vs Ar IR Sander and Exner, 1999

Additional references: Jacox, 2003, page 370

References

Sander and Exner, 1999
Sander, W.; Exner, M., J. Chem. Soc., 1999, Perkin Trans. 2, 2285. [all data]

Jacox, 2003
Jacox, M.E., Vibrational and electronic energy levels of polyatomic transient molecules: supplement B, J. Phys. Chem. Ref. Data, 2003, 32, 1, 1-441, https://doi.org/10.1063/1.1497629 . [all data]