(2,6-F2C6H3)CH2

Vibrational and/or electronic energy levels

Data compiled by: Marilyn E. Jacox

State:   A

 Energy
 (cm-1
 Med.   Transition   λmin
 (nm)
 λmax
 (nm)

References

To = 21774 gas A-X 459 488 Lee and Baek, 2000

State:   X

Vib.
sym.
 No.   Approximate
 type of mode
 cm-1   Med.   Method   References

a1 (1) 696 gas EM Lee and Baek, 2000
(6a) 470 gas EM Lee and Baek, 2000
(9a) 332 gas EM Lee and Baek, 2000
b2 (14) 1268 gas EM Lee and Baek, 2000

Additional references: Jacox, 2003, page 404

Lee and Baek, 2000
Lee, S.K.; Baek, D.Y., Observation of Vibronic Emission Spectrum of the Jet-Cooled 2,6-Difluorobenzyl Radical, J. Phys. Chem. A, 2000, 104, 22, 5219, https://doi.org/10.1021/jp9944684 . [all data]

Jacox, 2003
Jacox, M.E., Vibrational and electronic energy levels of polyatomic transient molecules: supplement B, J. Phys. Chem. Ref. Data, 2003, 32, 1, 1-441, https://doi.org/10.1063/1.1497629 . [all data]