C6S-

Vibrational and/or electronic energy levels

Data compiled by: Marilyn E. Jacox

State:   2Π

 Energy
 (cm-1
 Med.   Transition   λmin
 (nm)
 λmax
 (nm)

References

To = 16450 ± 5 Ne Riaplov and Maier, 2003

Riaplov and Maier, 2003
Riaplov, E.; Maier, J.P., Electronic Absorption Spectra of C, J. Phys. Chem. A, 2003, 107, 42, 8856, https://doi.org/10.1021/jp0351019 . [all data]