CdC5H4CH3

Vibrational and/or electronic energy levels

Data compiled by: Marilyn E. Jacox

State:   C

 Energy
 (cm-1
 Med.   Transition   λmin
 (nm)
 λmax
 (nm)

References

To = 22325 gas C-X 435 448 Robles, Ellis, et al., 1992

Vib.
sym.
 No.   Approximate
 type of mode
 cm-1   Med.   Method   References

a' 19 Cd..C5 stretch 206 gas LF Robles, Ellis, et al., 1992

State:   B

 Energy
 (cm-1
 Med.   Transition   λmin
 (nm)
 λmax
 (nm)

To = 22176 gas B-X 438 467 Robles, Ellis, et al., 1992

Vib.
sym.
 No.   Approximate
 type of mode
 cm-1   Med.   Method   References

a' 19 Cd..C5 stretch 218 gas LF Robles, Ellis, et al., 1992
a 36 Cd..C5 bend 123 H gas LF Robles, Ellis, et al., 1992

State:   A

 Energy
 (cm-1
 Med.   Transition   λmin
 (nm)
 λmax
 (nm)

To = 21057 gas A-X 450 505 Robles, Ellis, et al., 1992

Vib.
sym.
 No.   Approximate
 type of mode
 cm-1   Med.   Method   References

a' 19 Cd..C5 stretch 215 gas LF Robles, Ellis, et al., 1992
20 Cd..C5 bend 124 gas LF Robles, Ellis, et al., 1992
a 36 Cd..C5 bend 113 H gas LF Robles, Ellis, et al., 1992

State:   X

Vib.
sym.
 No.   Approximate
 type of mode
 cm-1   Med.   Method   References

a' 222 T gas LF Robles, Ellis, et al., 1992
19 Cd..C5 stretch 192 gas LF Robles, Ellis, et al., 1992
20 Cd..C5 bend 104 gas LF Robles, Ellis, et al., 1992
a 36 Cd..C5 bend 105 H gas LF Robles, Ellis, et al., 1992

Additional references: Jacox, 1994, page 404

Robles, Ellis, et al., 1992
Robles, E.S.J.; Ellis, A.M.; Miller, T.A., J. Chem. Soc., 1992, Faraday Trans. 88, 1927. [all data]

Jacox, 1994
Jacox, M.E., Vibrational and electronic energy levels of polyatomic transient molecules, American Chemical Society, Washington, DC, 1994, 464. [all data]