HC4CH=CH2+

Vibrational and/or electronic energy levels

Data compiled by: Marilyn E. Jacox

State:   A

 Energy
 (cm-1
 Med.   Transition   λmin
 (nm)
 λmax
 (nm)

References

To = 16544.97 gas A-X 581 604 Araki, Linnartz, et al., 2003
Khoroshev, Araki, et al., 2004
To = 16431 Ne A-X 585 609 Araki, Linnartz, et al., 2003

Vib.
sym.
 No.   Approximate
 type of mode
 cm-1   Med.   Method   References

a' 12 668.75 gas CR Khoroshev, Araki, et al., 2004
14 493.7 Ne AB Araki, Linnartz, et al., 2003
Khoroshev, Araki, et al., 2004
16 232.3 Ne AB Araki, Linnartz, et al., 2003
Khoroshev, Araki, et al., 2004

Araki, Linnartz, et al., 2003
Araki, M.; Linnartz, H.; Cias, P.; Denisov, A.; Fulara, J.; Batalov, A.; Shnitko, I.; Maier, J.P., High-resolution electronic spectroscopy of a nonlinear carbon chain radical C[sub 6]H[sub 4]+], J. Chem. Phys., 2003, 118, 23, 10561, https://doi.org/10.1063/1.1575736 . [all data]

Khoroshev, Araki, et al., 2004
Khoroshev, D.; Araki, M.; Kolek, P.; Birza, P.; Chirokolava, A.; Maier, J.P., Rotationally resolved electronic spectroscopy of a nonlinear carbon chain radical C6H4+, J. Mol. Spectrosc., 2004, 227, 1, 81, https://doi.org/10.1016/j.jms.2004.05.019 . [all data]