p-C6F4I

Vibrational and/or electronic energy levels

Data compiled by: Marilyn E. Jacox

State:   X

Vib.
sym.
 No.   Approximate
 type of mode
 cm-1   Med.   Method   References

a1 1474.4 w Ne IR Wenk, Balster, et al., 2001
1428.3 w m Ne IR Wenk, Balster, et al., 2001
1352.2 w Ne IR Wenk, Balster, et al., 2001
1188.1 w m Ne IR Wenk, Balster, et al., 2001
833.6 w m Ne IR Wenk, Balster, et al., 2001
b2 1471.7 vs Ne IR Wenk, Balster, et al., 2001
1259.4 w Ne IR Wenk, Balster, et al., 2001
1138.4 w Ne IR Wenk, Balster, et al., 2001
941.9 m Ne IR Wenk, Balster, et al., 2001
692.9 w m Ne IR Wenk, Balster, et al., 2001

Additional references: Jacox, 2003, page 397

References

Wenk, Balster, et al., 2001
Wenk, H.H.; Balster, A.; Sander, W.; Hrovat, D.A.; Borden, W.T., Matrix Isolation of Perfluorinated p-Benzyne, Angew. Chem. Int. Ed., 2001, 40, 12, 2295, https://doi.org/10.1002/1521-3773(20010618)40:12<2295::AID-ANIE2295>3.0.CO;2-W . [all data]

Jacox, 2003
Jacox, M.E., Vibrational and electronic energy levels of polyatomic transient molecules: supplement B, J. Phys. Chem. Ref. Data, 2003, 32, 1, 1-441, https://doi.org/10.1063/1.1497629 . [all data]