(CH3)2CCOCH3

Vibrational and/or electronic energy levels

Data compiled by: Marilyn E. Jacox

State:   B

 Energy
 (cm-1
 Med.   Transition   λmin
 (nm)
 λmax
 (nm)

References

gas B-X 330 364 Washida, Inomata, et al., 1998

Additional references: Jacox, 2003, page 392

Washida, Inomata, et al., 1998
Washida, N.; Inomata, S.; Furubayashi, M., Laser-Induced Fluorescence of Methyl Substituted Vinoxy Radicals and Reactions of Oxygen Atoms with Olefins, J. Phys. Chem. A, 1998, 102, 41, 7924, https://doi.org/10.1021/jp9822586 . [all data]

Jacox, 2003
Jacox, M.E., Vibrational and electronic energy levels of polyatomic transient molecules: supplement B, J. Phys. Chem. Ref. Data, 2003, 32, 1, 1-441, https://doi.org/10.1063/1.1497629 . [all data]