C4S-

Vibrational and/or electronic energy levels

Data compiled by: Marilyn E. Jacox

State:   B

 Energy
 (cm-1
 Med.   Transition   λmin
 (nm)
 λmax
 (nm)

References

To = 17593 ± 6 Ne B-X 483 569 Riaplov, Wyss, et al., 2001

Vib.
sym.
 No.   Approximate
 type of mode
 cm-1   Med.   Method   References

Σ+ 1 1955 ± 10 Ne AB Riaplov, Wyss, et al., 2001
2 1861 ± 10 Ne AB Riaplov, Wyss, et al., 2001
4 502 ± 10 Ne AB Riaplov, Wyss, et al., 2001
Π 6 305 ± 10 H Ne AB Riaplov, Wyss, et al., 2001
7 114 ± 10 Ne AB Riaplov, Wyss, et al., 2001

Riaplov, Wyss, et al., 2001
Riaplov, E.; Wyss, M.; Lakin, N.M.; Maier, J.P., Electronic Absorption Spectra of C, J. Phys. Chem. A, 2001, 105, 20, 4894, https://doi.org/10.1021/jp010479x . [all data]