c-CH3CH=CHCH3+

Vibrational and/or electronic energy levels

Data compiled by: Marilyn E. Jacox

State:   X

Vib.
sym.
 No.   Approximate
 type of mode
 cm-1   Med.   Method   References

a1 4 1553 gas TPE Woo, Zhan, et al., 2002
Woo, Lau, et al., 2003
5 1398 gas TPE Woo, Zhan, et al., 2002
Woo, Lau, et al., 2003
6 1298 gas TPE Woo, Zhan, et al., 2002
Woo, Lau, et al., 2003
7 1263 gas TPE Woo, Zhan, et al., 2002
Woo, Lau, et al., 2003
8 1038 gas TPE Woo, Zhan, et al., 2002
Woo, Lau, et al., 2003
9 756 gas TPE Woo, Zhan, et al., 2002
Woo, Lau, et al., 2003
10 293 gas TPE Woo, Zhan, et al., 2002
Woo, Lau, et al., 2003
a2 15 179 gas TPE Woo, Zhan, et al., 2002
Woo, Lau, et al., 2003
16 35 gas TPE Woo, Lau, et al., 2003
b1 21 128 gas TPE Woo, Zhan, et al., 2002
Woo, Lau, et al., 2003

References

Woo, Zhan, et al., 2002
Woo, H.K.; Zhan, J.; Lau, K.-C.; Ng, C.Y.; Cheung, Y.-S., Vacuum ultraviolet laser pulsed field ionization photoelectron study of cis-2-butene, J. Chem. Phys., 2002, 116, 20, 8803, https://doi.org/10.1063/1.1473663 . [all data]

Woo, Lau, et al., 2003
Woo, H.K.; Lau, K.-C.; Zhan, J.; Ng, C.Y.; Li, C.-L.; Li, W.-K.; Johnson, P.M., Vacuum ultraviolet laser pulsed field ionization photoelectron study of trans-2-butene, J. Chem. Phys., 2003, 119, 15, 7789, https://doi.org/10.1063/1.1609977 . [all data]