C(CH2)3-

Vibrational and/or electronic energy levels

Data compiled by: Marilyn E. Jacox

State:   ?

 Energy
 (cm-1
 Med.   Transition   λmin
 (nm)
 λmax
 (nm)

References

Td = 3480 ± 50 gas Wenthold, Hu, et al., 1996
Wenthold, Hu, et al., 1999

State:   X

Vib.
sym.
 No.   Approximate
 type of mode
 cm-1   Med.   Method   References

505 ± 20 gas PE Wenthold, Hu, et al., 1999

Additional references: Jacox, 1998, page 343

Wenthold, Hu, et al., 1996
Wenthold, P.G.; Hu, J.; Squires, R.R.; Lineberger, W.C., Photoelectron Spectroscopy of the Trimethylenemethane Negative Ion. The Singlet-Triplet Splitting of Trimethylenemethane., J. Am. Chem. Soc., 1996, 118, 2, 475, https://doi.org/10.1021/ja9532547 . [all data]

Wenthold, Hu, et al., 1999
Wenthold, P.G.; Hu, J.; Squires, R.R.; Lineberger, W.C., Photoelectron spectroscopy of the trimethylenemethane negative ion, J. Am. Soc. Mass Spectrom., 1999, 10, 9, 800, https://doi.org/10.1016/S1044-0305(99)00043-4 . [all data]

Jacox, 1998
Jacox, M.E., Vibrational and electronic energy levels of polyatomic transient molecules: supplement A, J. Phys. Chem. Ref. Data, 1998, 27, 2, 115-393, https://doi.org/10.1063/1.556017 . [all data]