F2C=(cyc-C3F2)

Vibrational and/or electronic energy levels

Data compiled by: Marilyn E. Jacox

State:   X

Vib.
sym.
 No.   Approximate
 type of mode
 cm-1   Med.   Method   References

a1 Skel. breathing 2000.1 w m Ar IR Kotting, Sander, et al., 1998
1241.9 m Ar IR Kotting, Sander, et al., 1998
874.5 m s Ar IR Kotting, Sander, et al., 1998
b2 FCCF a-stretch 1317.8 vs Ar IR Kotting, Sander, et al., 1998
CF2 a-stretch 1252.8 m s Ar IR Kotting, Sander, et al., 1998

Additional references: Jacox, 2003, page 363

References

Kotting, Sander, et al., 1998
Kotting, C.; Sander, W.; Senzlober, M., Evidence for the Non-Concerted Addition of Difluorovinylidene to Acetylenes, Chem. Eur. J., 1998, 4, 11, 2360, https://doi.org/10.1002/(SICI)1521-3765(19981102)4:11<2360::AID-CHEM2360>3.0.CO;2-Y . [all data]

Jacox, 2003
Jacox, M.E., Vibrational and electronic energy levels of polyatomic transient molecules: supplement B, J. Phys. Chem. Ref. Data, 2003, 32, 1, 1-441, https://doi.org/10.1063/1.1497629 . [all data]