cyc-NiC3-

Vibrational and/or electronic energy levels

Data compiled by: Marilyn E. Jacox

State:   ?

 Energy
 (cm-1
 Med.   Transition   λmin
 (nm)
 λmax
 (nm)

References

Td = 11210 ± 400 gas Wang and Li, 2000

Additional references: Jacox, 2003, page 209

Wang and Li, 2000
Wang, L.-S.; Li, X., Vibrationally resolved photoelectron spectroscopy of the first row transition metal and C[sub 3] clusters: MC[sub 3][sup -] (M=Sc, V, Cr, Mn, Fe, Co, and Ni), J. Chem. Phys., 2000, 112, 8, 3602, https://doi.org/10.1063/1.480513 . [all data]

Jacox, 2003
Jacox, M.E., Vibrational and electronic energy levels of polyatomic transient molecules: supplement B, J. Phys. Chem. Ref. Data, 2003, 32, 1, 1-441, https://doi.org/10.1063/1.1497629 . [all data]