(N3)2(cyc-C3N3)N

Vibrational and/or electronic energy levels

Data compiled by: Marilyn E. Jacox

State:   ?

 Energy
 (cm-1
 Med.   Transition   λmin
 (nm)
 λmax
 (nm)

References

Tx = 29070 N2 Sato, Narazaki, et al., 2003

State:   X

Vib.
sym.
 No.   Approximate
 type of mode
 cm-1   Med.   Method   References

2187 N2 IR Sato, Narazaki, et al., 2004
2148 N2 IR Sato, Narazaki, et al., 2004
2141 N2 IR Sato, Narazaki, et al., 2004
2107 N2 IR Sato, Narazaki, et al., 2004
1505 N2 IR Sato, Narazaki, et al., 2004
1493 N2 IR Sato, Narazaki, et al., 2004
1480 N2 IR Sato, Narazaki, et al., 2004
1474 N2 IR Sato, Narazaki, et al., 2004
1417 N2 IR Sato, Narazaki, et al., 2004
1339 vs N2 IR Sato, Narazaki, et al., 2003
Sato, Narazaki, et al., 2004
1280 N2 IR Sato, Narazaki, et al., 2004
1238 N2 IR Sato, Narazaki, et al., 2004
1211 N2 IR Sato, Narazaki, et al., 2004
1177 N2 IR Sato, Narazaki, et al., 2004
1155 N2 IR Sato, Narazaki, et al., 2004
1012 N2 IR Sato, Narazaki, et al., 2004
979 N2 IR Sato, Narazaki, et al., 2004
964 N2 IR Sato, Narazaki, et al., 2004
800 N2 IR Sato, Narazaki, et al., 2004
738 N2 IR Sato, Narazaki, et al., 2004
703 N2 IR Sato, Narazaki, et al., 2004
590 N2 IR Sato, Narazaki, et al., 2004
575 N2 IR Sato, Narazaki, et al., 2004
555 N2 IR Sato, Narazaki, et al., 2004

Sato, Narazaki, et al., 2003
Sato, T.; Narazaki, A.; Kawaguchi, Y.; Niino, H.; Bucher, G., Dicyanocarbodiimide and Trinitreno-s-triazine Generated by Consecutive Photolysis of Triazido-s-triazine in a Low-Temperature Nitrogen Matrix, Angew. Chem. Int. Ed., 2003, 42, 42, 5206, https://doi.org/10.1002/anie.200351879 . [all data]

Sato, Narazaki, et al., 2004
Sato, T.; Narazaki, A.; Kawaguchi, Y.; Niino, H.; Bucher, G.; Grote, D.; Wolff, J.J.; Wenk, H.H.; Sander, W., Generation and Photoreactions of 2,4,6-Trinitreno-1,3,5-triazine, a Septet Trinitrene, J. Am. Chem. Soc., 2004, 126, 25, 7846, https://doi.org/10.1021/ja031794v . [all data]