t-1-C3H5Br+

Vibrational and/or electronic energy levels

Data compiled by: Marilyn E. Jacox

State:   X

Vib.
sym.
 No.   Approximate
 type of mode
 cm-1   Med.   Method   References

a' 4 2970 gas TPI Lee and Kim, 2003
5 1493 gas TPI TPE Lee and Kim, 2003
Woo, Wang, et al., 2004
6 1402 gas TPI TPE Lee and Kim, 2003
Woo, Wang, et al., 2004
7 1308 gas TPI Lee and Kim, 2003
8 1267 gas TPI TPE Lee and Kim, 2003
Woo, Wang, et al., 2004
9 1194 gas TPI Lee and Kim, 2003
9 1242 gas TPE Woo, Wang, et al., 2004
10 1124 gas TPI TPE Lee and Kim, 2003
Woo, Wang, et al., 2004
11 942 gas TPI TPE Lee and Kim, 2003
Woo, Wang, et al., 2004
12 787 gas TPI TPE Lee and Kim, 2003
Woo, Wang, et al., 2004
13 370 gas TPI TPE Lee and Kim, 2003
Woo, Wang, et al., 2004
14 238 gas TPI TPE Lee and Kim, 2003
Woo, Wang, et al., 2004
a 16 1357 gas TPI Lee and Kim, 2003
17 976 gas TPE Woo, Wang, et al., 2004
18 876 gas TPI Lee and Kim, 2003
18 826 gas TPE Woo, Wang, et al., 2004
19 752 gas TPI Lee and Kim, 2003
19 761 gas TPE Woo, Wang, et al., 2004
20 141 gas TPI TPE Lee and Kim, 2003
Woo, Wang, et al., 2004
21 CH3 torsion 154 gas TPI TPE Lee and Kim, 2003
Woo, Wang, et al., 2004

References

Lee and Kim, 2003
Lee, M.; Kim, M.S., One-Photon Mass-Analyzed Threshold Ionization Spectroscopy of, J. Phys. Chem. A, 2003, 107, 51, 11401, https://doi.org/10.1021/jp0368278 . [all data]

Woo, Wang, et al., 2004
Woo, H.K.; Wang, P.; Lau, K.-C.; Xing, X.; Ng, C.Y., Single-photon vacuum-ultraviolet laser-pulsed-field ionization-photoelectron studies of trans- and cis-1-bromopropenes, J. Chem. Phys., 2004, 120, 20, 9561, https://doi.org/10.1063/1.1718276 . [all data]