H3CSiCCH

Vibrational and/or electronic energy levels

Data compiled by: Marilyn E. Jacox

State:   X

Vib.
sym.
 No.   Approximate
 type of mode
 cm-1   Med.   Method   References

CH stretch 3308.6 vs Ar IR Maier, Reisenauer, et al.
CC stretch 2001.2 m s Ar IR Maier, Reisenauer, et al.
CH3 deform. 1430.0 w Ar IR Maier, Reisenauer, et al.
CH3 deform. 1218.8 m Ar IR Maier, Reisenauer, et al.
Si-CH3 stretch 620.2 s Ar IR Maier, Reisenauer, et al.
Si-CCH stretch 588.4 vs Ar IR Maier, Reisenauer, et al.

Additional references: Jacox, 2003, page 357

References

Maier, Reisenauer, et al.
Maier, G.; Reisenauer, H.P.; Egenolf, H.; Glatthaar, J., Eur. J. Org. Chem. 1998, 1307.. [all data]

Jacox, 2003
Jacox, M.E., Vibrational and electronic energy levels of polyatomic transient molecules: supplement B, J. Phys. Chem. Ref. Data, 2003, 32, 1, 1-441, https://doi.org/10.1063/1.1497629 . [all data]