H3CCCSiH

Vibrational and/or electronic energy levels

Data compiled by: Marilyn E. Jacox

State:   X

Vib.
sym.
 No.   Approximate
 type of mode
 cm-1   Med.   Method   References

CH3 stretch 2982.0 w Ar IR Maier, Reisenauer, et al.
CH3 stretch 2933.0 w Ar IR Maier, Reisenauer, et al.
CH3 stretch 2860 w Ar IR Maier, Reisenauer, et al.
CC stretch 2151.1 s Ar IR Maier, Reisenauer, et al.
CC stretch 2142.7 Ar IR Maier, Reisenauer, et al.
SiH stretch 1970.8 vs Ar IR Maier, Reisenauer, et al.
SiH stretch 1964.1 Ar IR Maier, Reisenauer, et al.
CH3 deform. 1442.5 w Ar IR Maier, Reisenauer, et al.
CH3 deform. 1437.6 w Ar IR Maier, Reisenauer, et al.
SiH bend 826.7 m Ar IR Maier, Reisenauer, et al.

Additional references: Jacox, 2003, page 356

References

Maier, Reisenauer, et al.
Maier, G.; Reisenauer, H.P.; Egenolf, H.; Glatthaar, J., Eur. J. Org. Chem. 1998, 1307.. [all data]

Jacox, 2003
Jacox, M.E., Vibrational and electronic energy levels of polyatomic transient molecules: supplement B, J. Phys. Chem. Ref. Data, 2003, 32, 1, 1-441, https://doi.org/10.1063/1.1497629 . [all data]