FeCCCH-

Vibrational and/or electronic energy levels

Data compiled by: Marilyn E. Jacox

State:   ?

 Energy
 (cm-1
 Med.   Transition   λmin
 (nm)
 λmax
 (nm)

References

Td = 10250 ± 650 gas Fan, Lou, et al., 1995

Additional references: Jacox, 1998, page 286

Fan, Lou, et al., 1995
Fan, J.; Lou, L.; Wang, L.-S., FeCn- and FeCnH- (n=3,4): A photoelectron spectroscopic and density functional study, J. Chem. Phys., 1995, 102, 7, 2701, https://doi.org/10.1063/1.468646 . [all data]

Jacox, 1998
Jacox, M.E., Vibrational and electronic energy levels of polyatomic transient molecules: supplement A, J. Phys. Chem. Ref. Data, 1998, 27, 2, 115-393, https://doi.org/10.1063/1.556017 . [all data]