Cr(CO)3-

Vibrational and/or electronic energy levels

Data compiled by: Marilyn E. Jacox

State:   X

Vib.
sym.
 No.   Approximate
 type of mode
 cm-1   Med.   Method   References

a1 2 CrCO bend 680 ± 10 gas PE Bengali, Casey, et al., 1992

References

Bengali, Casey, et al., 1992
Bengali, A.A.; Casey, S.M.; Cheng, C.-L.; Dick, J.P.; Fenn, T.; Villaalta, P.W.; Leopold, D.G., Negative Ion Photoelectron Spectroscopy of Coordinatively Unsaturated Group VI Metal Carbonyls: Cr(CO)3, Mo(CO)3, and W(CO)3, J. Am. Chem. Soc., 1992, 114, 13, 5257, https://doi.org/10.1021/ja00039a043 . [all data]