Y3C2

Vibrational and/or electronic energy levels

Data compiled by: Marilyn E. Jacox

State:   X

Vib.
sym.
 No.   Approximate
 type of mode
 cm-1   Med.   Method   References

a1 4 Y3 deformation 82.4 ± 0.4 gas TPE Yang, Zgierski, et al., 1998
b1 7 Y3 deformation 24.5 ± 0.2 gas TPE Yang, Zgierski, et al., 1998

Additional references: Jacox, 2003, page 277

References

Yang, Zgierski, et al., 1998
Yang, D.-S.; Zgierski, M.Z.; Hackett, P.A., Bonding and structure of Y[sub 3]C[sub 2] and Y[sub 3]C[sub 2][sup +], J. Chem. Phys., 1998, 108, 9, 3591, https://doi.org/10.1063/1.475753 . [all data]

Jacox, 2003
Jacox, M.E., Vibrational and electronic energy levels of polyatomic transient molecules: supplement B, J. Phys. Chem. Ref. Data, 2003, 32, 1, 1-441, https://doi.org/10.1063/1.1497629 . [all data]