VCC

Vibrational and/or electronic energy levels

Data compiled by: Marilyn E. Jacox

State:   C

 Energy
 (cm-1
 Med.   Transition   λmin
 (nm)
 λmax
 (nm)

References

To = 13800 ± 160 gas Li and Wang, 1999

Vib.
sym.
 No.   Approximate
 type of mode
 cm-1   Med.   Method   References

VC stretch 370 ± 40 gas PE Li and Wang, 1999

State:   B

 Energy
 (cm-1
 Med.   Transition   λmin
 (nm)
 λmax
 (nm)

To = 12020 ± 160 gas Li and Wang, 1999

Vib.
sym.
 No.   Approximate
 type of mode
 cm-1   Med.   Method   References

VC stretch 480 ± 40 gas PE Li and Wang, 1999

State:   A

 Energy
 (cm-1
 Med.   Transition   λmin
 (nm)
 λmax
 (nm)

To = 3870 ± 160 gas Li and Wang, 1999

Vib.
sym.
 No.   Approximate
 type of mode
 cm-1   Med.   Method   References

VC stretch 520 ± 50 gas PE Li and Wang, 1999

State:   X

Vib.
sym.
 No.   Approximate
 type of mode
 cm-1   Med.   Method   References

VC stretch 550 ± 40 gas PE Li and Wang, 1999

Additional references: Jacox, 2003, page 56

Li and Wang, 1999
Li, X.; Wang, L.-S., Electronic Structure and Chemical Bonding Between the First Row Transition Metals and C2: A Photoelectron Spectroscopy Study of MC2- (M=Sc, V, Cr, Mn, Fe, and Co), J. Chem. Phys., 1999, 111, 18, 8389, https://doi.org/10.1063/1.480218 . [all data]

Jacox, 2003
Jacox, M.E., Vibrational and electronic energy levels of polyatomic transient molecules: supplement B, J. Phys. Chem. Ref. Data, 2003, 32, 1, 1-441, https://doi.org/10.1063/1.1497629 . [all data]