TiCC-

Vibrational and/or electronic energy levels

Data compiled by: Marilyn E. Jacox

State:   ?

 Energy
 (cm-1
 Med.   Transition   λmin
 (nm)
 λmax
 (nm)

References

Td = 12440 ± 160 gas Wang, Ding, et al., 1997

State:   ?

 Energy
 (cm-1
 Med.   Transition   λmin
 (nm)
 λmax
 (nm)

Td = 12440 ± 160 gas Wang, Ding, et al., 1997

Additional references: Jacox, 2003, page 58

Wang, Ding, et al., 1997
Wang, X.; Ding, C.; Wang, L.S., Vibrationally Resolved Photoelectron Spectra of TiCx-(x=2-5) Clusters, J. Phys. Chem., 1997, 101, 42, 7699, https://doi.org/10.1021/jp971838k . [all data]

Jacox, 2003
Jacox, M.E., Vibrational and electronic energy levels of polyatomic transient molecules: supplement B, J. Phys. Chem. Ref. Data, 2003, 32, 1, 1-441, https://doi.org/10.1063/1.1497629 . [all data]