OUCCO

Vibrational and/or electronic energy levels

Data compiled by: Marilyn E. Jacox

State:   X

Vib.
sym.
 No.   Approximate
 type of mode
 cm-1   Med.   Method   References

1 CO stretch 2051.5 Ne IR Zhou, Andrews, et al., 1999
1361.8 Ne IR Zhou, Andrews, et al., 1999
UO stretch 841.0 Ne IR Zhou, Andrews, et al., 1999

Additional references: Jacox, 2003, page 287

References

Zhou, Andrews, et al., 1999
Zhou, M.; Andrews, L.; Li, J.; Bursten, B.E., Reaction of Laser-Ablated Uranium Atoms with CO: Infrared Spectra of the CUO, CUO, J. Am. Chem. Soc., 1999, 121, 41, 9712, https://doi.org/10.1021/ja9921322 . [all data]

Jacox, 2003
Jacox, M.E., Vibrational and electronic energy levels of polyatomic transient molecules: supplement B, J. Phys. Chem. Ref. Data, 2003, 32, 1, 1-441, https://doi.org/10.1063/1.1497629 . [all data]