OThCCO

Vibrational and/or electronic energy levels

Data compiled by: Marilyn E. Jacox

State:   X

Vib.
sym.
 No.   Approximate
 type of mode
 cm-1   Med.   Method   References

a' 1 CO stretch 2048.6 vs Ne IR Li, Bursten, et al., 2001
2 CC stretch 1353.6 w Ne IR Li, Bursten, et al., 2001
ThO stretch 822.5 w Ne IR Li, Bursten, et al., 2001

Additional references: Jacox, 2003, page 287

References

Li, Bursten, et al., 2001
Li, J.; Bursten, B.E.; Zhou, M.; Andrews, L., A Combined Theoretical and Experimental Study of the Reaction Products of Laser-Ablated Thorium Atoms with CO: First Identification of the CThO, CThO, Inorg. Chem., 2001, 40, 21, 5448, https://doi.org/10.1021/ic010755m . [all data]

Jacox, 2003
Jacox, M.E., Vibrational and electronic energy levels of polyatomic transient molecules: supplement B, J. Phys. Chem. Ref. Data, 2003, 32, 1, 1-441, https://doi.org/10.1063/1.1497629 . [all data]