OTaCCO

Vibrational and/or electronic energy levels

Data compiled by: Marilyn E. Jacox

State:   X

Vib.
sym.
 No.   Approximate
 type of mode
 cm-1   Med.   Method   References

1 CO stretch 2087.5 Ne IR Zhou and Andrews, 1999
TaO stretch 965.7 Ne IR Zhou and Andrews, 1999

Additional references: Jacox, 2003, page 285

References

Zhou and Andrews, 1999
Zhou, M.; Andrews, L., Infrared Spectra of CNbO, CMO, J. Phys. Chem. A, 1999, 103, 39, 7785, https://doi.org/10.1021/jp991552a . [all data]

Jacox, 2003
Jacox, M.E., Vibrational and electronic energy levels of polyatomic transient molecules: supplement B, J. Phys. Chem. Ref. Data, 2003, 32, 1, 1-441, https://doi.org/10.1063/1.1497629 . [all data]