Rh(CO)2+

Vibrational and/or electronic energy levels

Data compiled by: Marilyn E. Jacox

State:   X

Vib.
sym.
 No.   Approximate
 type of mode
 cm-1   Med.   Method   References

CO stretch 2184.7 Ne IR Zhou and Andrews, 1999
Zhou and Andrews, 1999, 2

Additional references: Jacox, 2003, page 281

References

Zhou and Andrews, 1999
Zhou, M.; Andrews, L., Infrared Spectra of RhCO, J. Am. Chem. Soc., 1999, 121, 39, 9171, https://doi.org/10.1021/ja991180j . [all data]

Zhou and Andrews, 1999, 2
Zhou, M.; Andrews, L., Reactions of Laser-Ablated Co, Rh, and Ir with CO: Infrared Spectra and Density Functional Calculations of the Metal Carbonyl Molecules, Cations and Anions in Solid Neon, J. Phys. Chem. A, 1999, 103, 39, 7773, https://doi.org/10.1021/jp991400f . [all data]

Jacox, 2003
Jacox, M.E., Vibrational and electronic energy levels of polyatomic transient molecules: supplement B, J. Phys. Chem. Ref. Data, 2003, 32, 1, 1-441, https://doi.org/10.1063/1.1497629 . [all data]