In(CO)2

Vibrational and/or electronic energy levels

Data compiled by: Marilyn E. Jacox

State:   X

Vib.
sym.
 No.   Approximate
 type of mode
 cm-1   Med.   Method   References

CO s-stretch 2029.2 Ar IR Himmel, Downs, et al., 2000
CO a-stretch 1980.2 Ar IR Himmel, Downs, et al., 2000
483 w Ar IR Himmel, Downs, et al., 2000

Additional references: Jacox, 2003, page 292

References

Himmel, Downs, et al., 2000
Himmel, H.-J.; Downs, A.J.; Green, J.C.; Greene, T.M., Thermal and Photolytic Reactions of Gallium and Indium Atoms (M) and Their Dimers M, J. Phys. Chem. A, 2000, 104, 16, 3642, https://doi.org/10.1021/jp9938359 . [all data]

Jacox, 2003
Jacox, M.E., Vibrational and electronic energy levels of polyatomic transient molecules: supplement B, J. Phys. Chem. Ref. Data, 2003, 32, 1, 1-441, https://doi.org/10.1063/1.1497629 . [all data]