C2H5O-

Vibrational and/or electronic energy levels

Data compiled by: Marilyn E. Jacox

State:   ?

 Energy
 (cm-1
 Med.   Transition   λmin
 (nm)
 λmax
 (nm)

References

Td = 13810 ± 30 gas Ellison, Engleking, et al., 1982
Dang, Motell, et al., 1993
Ramond, Davico, et al., 2000

State:   X

Vib.
sym.
 No.   Approximate
 type of mode
 cm-1   Med.   Method   References

1250 ± 400 gas PE Ellison, Engleking, et al., 1982

Additional references: Jacox, 2003, page 353

Ellison, Engleking, et al., 1982
Ellison, G.B.; Engleking, P.C.; Lineberger, W.C., Photoelectron spectroscopy of alkoxide and enolate negative ions, J. Phys. Chem., 1982, 86, 4873. [all data]

Dang, Motell, et al., 1993
Dang, T.T.; Motell, E.L.; Travers, M.J.; Clifford, E.P.; Ellison, G.B.; Depuy, C.H.; Bierbaum, V.M., Experimental and Computational Studies of Deuterated Ethanols - Gas-Phase Acidities, Electron Affinities and Bond Dissociation Energies, Int. J. Mass Spectrom. Ion Proc., 1993, 123, 3, 171, https://doi.org/10.1016/0168-1176(93)87096-B . [all data]

Ramond, Davico, et al., 2000
Ramond, T.M.; Davico, G.E.; Schwartz, R.L.; Lineberger, W.C., Vibronic structure of alkoxy radicals via photoelectron spectroscopy, J. Chem. Phys., 2000, 112, 3, 1158, https://doi.org/10.1063/1.480767 . [all data]

Jacox, 2003
Jacox, M.E., Vibrational and electronic energy levels of polyatomic transient molecules: supplement B, J. Phys. Chem. Ref. Data, 2003, 32, 1, 1-441, https://doi.org/10.1063/1.1497629 . [all data]