HCCSiSiH3

Vibrational and/or electronic energy levels

Data compiled by: Marilyn E. Jacox

State:   X

Vib.
sym.
 No.   Approximate
 type of mode
 cm-1   Med.   Method   References

CH stretch 3294.1 w m Ar IR Maier, Reisenauer, et al.
CH stretch 3291.1 Ar IR Maier, Reisenauer, et al.
SiH3 stretch 2168 T Ar IR Maier, Reisenauer, et al.
SiH3 deform. 856.0 vs Ar IR Maier, Reisenauer, et al.
SiH3 deform. 854.5 Ar IR Maier, Reisenauer, et al.
HCC deform. 690.1 w m Ar IR Maier, Reisenauer, et al.
SiC stretch 586.0 m Ar IR Maier, Reisenauer, et al.

Additional references: Jacox, 2003, page 358

References

Maier, Reisenauer, et al.
Maier, G.; Reisenauer, H.P.; Egenolf, H.; Glatthaar, J., Eur. J. Org. Chem. 1998, 1307.. [all data]

Jacox, 2003
Jacox, M.E., Vibrational and electronic energy levels of polyatomic transient molecules: supplement B, J. Phys. Chem. Ref. Data, 2003, 32, 1, 1-441, https://doi.org/10.1063/1.1497629 . [all data]